BDBM195419 US10336717, Compound 2::US9212153, 2
SMILES COC1CCC2(Cc3ccc(cc3C22ON(C)C(N)=N2)-c2cc(Cl)cc(c2)C#N)CC1
InChI Key InChIKey=UUXWNRAWHSOACD-UHFFFAOYSA-N
Data  2 IC50
  Tab Delimited (TSV)   2D SDfile   Computed 3D by Vconf -m prep SDfile
Find this compound or compounds like it in BindingDB:
Activity Spreadsheet -- Enzyme Inhibition Constant Data from BindingDB
Found 2 hits for monomerid = 195419
TargetBeta-secretase 1(Homo sapiens (Human))
Vitae Pharmaceuticals
US Patent
LigandPNGBDBM195419(US10336717, Compound 2 | US9212153, 2)
Affinity DataIC50:  3.5nM. Assay description: For each compound being tested, the BACE activity was monitored in a fluorescence quenching assay (FRET) using the ectodomain of BACE (aa 1-454) fuse...
Ligand InfoPC cidPC sid
In DepthDetails US Patent
TargetBeta-secretase 1 [1-458](Homo sapiens (Human))
Vitae Pharmaceuticals
US Patent
LigandPNGBDBM195419(US10336717, Compound 2 | US9212153, 2)
Affinity DataIC50:  3.5nMpH: 4.5 T: 2°C. Assay description: Inhibitory activity of compounds was assessed by a fluorescence quench assay of BACE activity using commercially available substrate HiLyte Fluor 488...
Ligand InfoPC cidPC sid
In DepthDetails US Patent