BDBM195451 US9670212, 66 3-amino-N-[(2-{4-[2-(dimethylamino)-2-oxoethyl]-1,4-diazepan-1-yl}-8-methylquinolin-3-yl)methyl]pyrazine-2-carboxamide
SMILES CN(C)C(=O)CN1CCCN(CC1)c1nc2c(C)cccc2cc1CNC(=O)c1nccnc1N
InChI Key InChIKey=AVLRDYFRSVCJIF-UHFFFAOYSA-N
Data  1 IC50
  Tab Delimited (TSV)   2D SDfile   Computed 3D by Vconf -m prep SDfile
Find this compound or compounds like it in BindingDB:
Activity Spreadsheet -- Enzyme Inhibition Constant Data from BindingDB
Found 1 hit for monomerid = 195451
LigandPNGBDBM195451(US9670212, 66 3-amino-N-[(2-{4-[2-(dimethylamino)-...)
Affinity DataIC50:  1.00E+3nM. Assay description: Kinase activity is measured as the percent of ATP consumed following the kinase reaction using luciferase-luciferin-coupled chemiluminescence. Reacti...
Ligand InfoPC cidPC sid
In DepthDetails US Patent