BDBM195521 US9212153, 334,Ex. 282
SMILES COC1CCC2(Cc3ccc(cc3[C@]22N=C(N)N(C[C@@H]3CCCO3)C2=O)C#CC2CC2)CC1
InChI Key InChIKey=BHUFUPBWYHSWOM-LIWKPHSCSA-N
Data  1 IC50
  Tab Delimited (TSV)   2D SDfile   Computed 3D by Vconf -m prep SDfile
Find this compound or compounds like it in BindingDB:
Activity Spreadsheet -- Enzyme Inhibition Constant Data from BindingDB
Found 1 hit for monomerid = 195521
TargetBeta-secretase 1 [1-458](Homo sapiens (Human))
Vitae Pharmaceuticals
US Patent
LigandPNGBDBM195521(US9212153, 334,Ex. 282)
Affinity DataIC50:  1.70nMpH: 4.4Assay Description:For each compound being tested, the BACE activity was monitored in a fluorescence quenching assay (FRET) using the ectodomain of BACE (aa 1-454) fuse...
Ligand InfoPC cidPC sid
In DepthDetails US Patent