BDBM19553 (2S)-3-(4-chlorophenyl)-N-{2-[(4-methoxyphenyl)amino]ethyl}-2-[(3-methylphenyl)formamido]propanamide::arylaminoethyl amide, 5g
SMILES COc1ccc(NCCNC(=O)[C@H](Cc2ccc(Cl)cc2)NC(=O)c2cccc(C)c2)cc1
InChI Key InChIKey=SLCGCUWBLKUHMZ-DEOSSOPVSA-N
Data  3 KI
  Tab Delimited (TSV)   2D SDfile   Computed 3D by Vconf -m prep SDfile
Find this compound or compounds like it in BindingDB:
Activity Spreadsheet -- Enzyme Inhibition Constant Data from BindingDB
Found 3 hits for monomerid = 19553
TargetProcathepsin L(Homo sapiens (Human))
Gnf
LigandPNGBDBM19553((2S)-3-(4-chlorophenyl)-N-{2-[(4-methoxyphenyl)ami...)
Affinity DataKi:  1.40nM. Assay description: The recombinant human cathepsin enzyme was preincubated with inhibitor for 20 minutes prior to addition of substrate. The substrate hydrolysis was mo...
In DepthDetails ArticlePubMed
TargetCathepsin S(Homo sapiens (Human))
Gnf
LigandPNGBDBM19553((2S)-3-(4-chlorophenyl)-N-{2-[(4-methoxyphenyl)ami...)
Affinity DataKi:  16nM ΔG°:  -11.1kcal/molepH: 5.5 T: 2°C. Assay description: The recombinant human cathepsin enzyme was preincubated with inhibitor for 20 minutes prior to addition of substrate. The substrate hydrolysis was mo...
In DepthDetails ArticlePubMed
TargetCathepsin K(Homo sapiens (Human))
Gnf
LigandPNGBDBM19553((2S)-3-(4-chlorophenyl)-N-{2-[(4-methoxyphenyl)ami...)
Affinity DataKi: >1.00E+5nM. Assay description: The recombinant human cathepsin enzyme was preincubated with inhibitor for 20 minutes prior to addition of substrate. The substrate hydrolysis was mo...
In DepthDetails ArticlePubMed