BDBM195542 2-((4-Chlorobenzylidene)amino)-5-mercapto-1,3,4-thiadiazole (4)
SMILES Sc1nnc(N=Cc2ccc(Cl)cc2)s1
InChI Key InChIKey=DUKBFSWBEKKLEQ-VZUCSPMQSA-N
Data  1 IC50
  Tab Delimited (TSV)   2D SDfile   Computed 3D by Vconf -m prep SDfile
Find this compound or compounds like it in BindingDB:
Activity Spreadsheet -- Enzyme Inhibition Constant Data from BindingDB
Found 1 hit for monomerid = 195542
TargetPolyphenol oxidase 1 [61-568](Agaricus bisporus (Mushroom))
Shaoyang University
LigandPNGBDBM195542(2-((4-Chlorobenzylidene)amino)-5-mercapto-1,3,4-th...)
Affinity DataIC50:  2.46E+3nMpH: 6.8Assay Description:Briefly, 1,3,4-thiadiazole derivatives were tested for diphenolase inhibitory activity of tyrosinase using L-DOPA (dihydroxyphenylalanine) as substra...
Ligand InfoPC cidPC sid
In DepthDetails ArticlePubMed