BDBM195546 2-((4-(Tert-butyl)benzylidene)amino)-5-mercapto-1,3,4-thiadiazole (8)
SMILES CC(C)(C)c1ccc(C=Nc2nnc(S)s2)cc1
InChI Key InChIKey=RWXOZKCHMXJZQN-RIYZIHGNSA-N
Data  1 IC50
  Tab Delimited (TSV)   2D SDfile   Computed 3D by Vconf -m prep SDfile
Find this compound or compounds like it in BindingDB:
Activity Spreadsheet -- Enzyme Inhibition Constant Data from BindingDB
Found 1 hit for monomerid = 195546
TargetPolyphenol oxidase 1 [61-568](Agaricus bisporus (Mushroom))
Shaoyang University
LigandPNGBDBM195546(2-((4-(Tert-butyl)benzylidene)amino)-5-mercapto-1,...)
Affinity DataIC50:  1.39E+3nMpH: 6.8Assay Description:Briefly, 1,3,4-thiadiazole derivatives were tested for diphenolase inhibitory activity of tyrosinase using L-DOPA (dihydroxyphenylalanine) as substra...
Ligand InfoPC cidPC sid
In DepthDetails ArticlePubMed