BDBM195701 US9206173, 2463
SMILES CC(Nc1nc2CCN(Cc2c(=O)n1N1CCOCC1)C(=O)c1ccc(cc1F)C#N)c1ccc(cc1)C(F)(F)F
InChI Key InChIKey=QMRFFEZAPIUDEJ-UHFFFAOYSA-N
Data  1 KI  1 IC50
  Tab Delimited (TSV)   2D SDfile   Computed 3D by Vconf -m prep SDfile
Find this compound or compounds like it in BindingDB:
Activity Spreadsheet -- Enzyme Inhibition Constant Data from BindingDB
Found 2 hits for monomerid = 195701
TargetProlactin-releasing peptide receptor(Homo sapiens (Human))
Otsuka Pharmaceutical
US Patent
LigandPNGBDBM195701(US9206173, 2463)
Affinity DataKi:  3nM ΔG°:  -11.6kcal/molepH: 7.4 T: 2°C. Assay description: Receptor-expressing HEK 293 cell membrane fraction was analyzed by modifying the methods of C. J. Langmead et al. (see Langmead C J, Szekeres P G; Ch...
Ligand InfoPC cidPC sid
In DepthDetails US Patent
TargetProlactin-releasing peptide receptor(Homo sapiens (Human))
Otsuka Pharmaceutical
US Patent
LigandPNGBDBM195701(US9206173, 2463)
Affinity DataIC50:  187nMpH: 7.4 T: 2°C. Assay description: HEK293 cells expressing human GPR10 were maintained in Dulbecco's Modified Eagles' medium supplemented with 10% fetal bovine serum, 1% penici...
Ligand InfoPC cidPC sid
In DepthDetails US Patent