BDBM195806 US9206188, 57::US9834551, Example 57
SMILES C=CC(=O)Nc1cccc(n1)-c1cnc2[nH]ccc2c1
InChI Key InChIKey=HUBFPPMICSBHGU-UHFFFAOYSA-N
Data  6 IC50
  Tab Delimited (TSV)   2D SDfile   Computed 3D by Vconf -m prep SDfile
Find this compound or compounds like it in BindingDB:
Activity Spreadsheet -- Enzyme Inhibition Constant Data from BindingDB
Found 6 hits for monomerid = 195806
TargetTyrosine-protein kinase ITK/TSK(Homo sapiens (Human))
Arrien Pharmaceuticals
US Patent
LigandPNGBDBM195806(US9206188, 57 | US9834551, Example 57)
Affinity DataIC50:  30nM. Assay description: 1H-pyrrolo[2,3-b]pyridine, 1H-pyrazolo[3,4-b]pyridine and 5H-pyrrolo[2,3-b]pyrazine series of compounds exhibited over >100 fold selective against Ja...
Ligand InfoPC cidPC sid
In DepthDetails US Patent
TargetTyrosine-protein kinase BTK(Homo sapiens (Human))
Arrien Pharmaceuticals
US Patent
LigandPNGBDBM195806(US9206188, 57 | US9834551, Example 57)
Affinity DataIC50:  739nM. Assay description: 1H-pyrrolo[2,3-b]pyridine, 1H-pyrazolo[3,4-b]pyridine and 5H-pyrrolo[2,3-b]pyrazine series of compounds exhibited over >100 fold selective against Ja...
Ligand InfoPC cidPC sid
In DepthDetails US Patent
TargetTyrosine-protein kinase JAK3(Homo sapiens (Human))
Arrien Pharmaceuticals
US Patent
LigandPNGBDBM195806(US9206188, 57 | US9834551, Example 57)
Affinity DataIC50: <100nM. Assay description: ITK and JAK3 Kinase assay procedures:Enzyme was incubated with substrate peptide in reaction buffer in the presence and absence of test compounds or ...
Ligand InfoPC cidPC sid
In DepthDetails US Patent
TargetTyrosine-protein kinase JAK3(Homo sapiens (Human))
Arrien Pharmaceuticals
US Patent
LigandPNGBDBM195806(US9206188, 57 | US9834551, Example 57)
Affinity DataIC50: <5nM. Assay description: 1H-pyrrolo[2,3-b]pyridine, 1H-pyrazolo[3,4-b]pyridine and 5H-pyrrolo[2,3-b]pyrazine series of compounds exhibited over >100 fold selective against Ja...
Ligand InfoPC cidPC sid
In DepthDetails US Patent
TargetTyrosine-protein kinase ITK/TSK(Homo sapiens (Human))
Arrien Pharmaceuticals
US Patent
LigandPNGBDBM195806(US9206188, 57 | US9834551, Example 57)
Affinity DataIC50: >100nM. Assay description: ITK and JAK3 Kinase assay procedures:Enzyme was incubated with substrate peptide in reaction buffer in the presence and absence of test compounds or ...
Ligand InfoPC cidPC sid
In DepthDetails US Patent
TargetTyrosine-protein kinase ITK/TSK(Homo sapiens (Human))
Arrien Pharmaceuticals
US Patent
LigandPNGBDBM195806(US9206188, 57 | US9834551, Example 57)
Affinity DataIC50:  35nM. Assay description: 1H-pyrrolo[2,3-b]pyridine, 1H-pyrazolo[3,4-b]pyridine and 5H-pyrrolo[2,3-b]pyrazine series of compounds exhibited over >100 fold selective against Ja...
Ligand InfoPC cidPC sid
In DepthDetails US Patent