BDBM195809 US9206188, 60::US9834551, Example 60
SMILES Fc1ccc(cc1NC(=O)C=C)-c1cnc2[nH]cc(Cl)c2c1
InChI Key InChIKey=XEBONUXGQPQTAE-UHFFFAOYSA-N
Data  6 IC50
  Tab Delimited (TSV)   2D SDfile   Computed 3D by Vconf -m prep SDfile
Find this compound or compounds like it in BindingDB:
Activity Spreadsheet -- Enzyme Inhibition Constant Data from BindingDB
Found 6 hits for monomerid = 195809
TargetTyrosine-protein kinase ITK/TSK(Homo sapiens (Human))
Arrien Pharmaceuticals
US Patent
LigandPNGBDBM195809(US9206188, 60 | US9834551, Example 60)
Affinity DataIC50:  30nM. Assay description: 1H-pyrrolo[2,3-b]pyridine, 1H-pyrazolo[3,4-b]pyridine and 5H-pyrrolo[2,3-b]pyrazine series of compounds exhibited over >100 fold selective against Ja...
Ligand InfoPC cidPC sid
In DepthDetails US Patent
TargetTyrosine-protein kinase BTK(Homo sapiens (Human))
Arrien Pharmaceuticals
US Patent
LigandPNGBDBM195809(US9206188, 60 | US9834551, Example 60)
Affinity DataIC50:  739nM. Assay description: 1H-pyrrolo[2,3-b]pyridine, 1H-pyrazolo[3,4-b]pyridine and 5H-pyrrolo[2,3-b]pyrazine series of compounds exhibited over >100 fold selective against Ja...
Ligand InfoPC cidPC sid
In DepthDetails US Patent
TargetTyrosine-protein kinase JAK3(Homo sapiens (Human))
Arrien Pharmaceuticals
US Patent
LigandPNGBDBM195809(US9206188, 60 | US9834551, Example 60)
Affinity DataIC50: <100nM. Assay description: ITK and JAK3 Kinase assay procedures:Enzyme was incubated with substrate peptide in reaction buffer in the presence and absence of test compounds or ...
Ligand InfoPC cidPC sid
In DepthDetails US Patent
TargetTyrosine-protein kinase JAK3(Homo sapiens (Human))
Arrien Pharmaceuticals
US Patent
LigandPNGBDBM195809(US9206188, 60 | US9834551, Example 60)
Affinity DataIC50: <5nM. Assay description: 1H-pyrrolo[2,3-b]pyridine, 1H-pyrazolo[3,4-b]pyridine and 5H-pyrrolo[2,3-b]pyrazine series of compounds exhibited over >100 fold selective against Ja...
Ligand InfoPC cidPC sid
In DepthDetails US Patent
TargetTyrosine-protein kinase ITK/TSK(Homo sapiens (Human))
Arrien Pharmaceuticals
US Patent
LigandPNGBDBM195809(US9206188, 60 | US9834551, Example 60)
Affinity DataIC50: >100nM. Assay description: ITK and JAK3 Kinase assay procedures:Enzyme was incubated with substrate peptide in reaction buffer in the presence and absence of test compounds or ...
Ligand InfoPC cidPC sid
In DepthDetails US Patent
TargetTyrosine-protein kinase ITK/TSK(Homo sapiens (Human))
Arrien Pharmaceuticals
US Patent
LigandPNGBDBM195809(US9206188, 60 | US9834551, Example 60)
Affinity DataIC50:  35nM. Assay description: 1H-pyrrolo[2,3-b]pyridine, 1H-pyrazolo[3,4-b]pyridine and 5H-pyrrolo[2,3-b]pyrazine series of compounds exhibited over >100 fold selective against Ja...
Ligand InfoPC cidPC sid
In DepthDetails US Patent