BDBM195873 US9670213, Compound 018 N-(3-(2-(4-morpholinophenylamino)-7-oxo-8(7H)-pteridin-yl)phenyl) acrylamide
SMILES C=CC(=O)Nc1cccc(c1)-n1c2nc(Nc3ccc(cc3)N3CCOCC3)ncc2ncc1=O
InChI Key InChIKey=NXZQKEJXOSVRFZ-UHFFFAOYSA-N
Data  9 IC50
  Tab Delimited (TSV)   2D SDfile   Computed 3D by Vconf -m prep SDfile
Find this compound or compounds like it in BindingDB:
Activity Spreadsheet -- Enzyme Inhibition Constant Data from BindingDB
Found 9 hits for monomerid = 195873
TargetEpidermal growth factor receptor(Homo sapiens (Human))
East China University Of Science And Technology
US Patent
LigandPNGBDBM195873(US9670213, Compound 018 N-(3-(2-(4-morpholinopheny...)
Affinity DataIC50:  7.94nMT: 2°C. Assay description: In vitro enzyme activity assay: wild-type and various mutants (T790M, L858R, L861Q, L858 R/T790M) EGFR, Z′-Lyte Kinase Assay Kit were purchased...
Ligand InfoPC cidPC sid
In DepthDetails US Patent
TargetEpidermal growth factor receptor [L858R](Homo sapiens (Human))
East China University Of Science And Technology
US Patent
LigandPNGBDBM195873(US9670213, Compound 018 N-(3-(2-(4-morpholinopheny...)
Affinity DataIC50:  5.83nMT: 2°C. Assay description: In vitro enzyme activity assay: wild-type and various mutants (T790M, L858R, L861Q, L858 R/T790M) EGFR, Z′-Lyte Kinase Assay Kit were purchased...
Ligand InfoPC cidPC sid
In DepthDetails US Patent
TargetEpidermal growth factor receptor [T790M,L858R](Homo sapiens (Human))
East China University Of Science And Technology
US Patent
LigandPNGBDBM195873(US9670213, Compound 018 N-(3-(2-(4-morpholinopheny...)
Affinity DataIC50:  3.02nMT: 2°C. Assay description: In vitro enzyme activity assay: wild-type and various mutants (T790M, L858R, L861Q, L858 R/T790M) EGFR, Z′-Lyte Kinase Assay Kit were purchased...
Ligand InfoPC cidPC sid
In DepthDetails US Patent
TargetTyrosine-protein kinase Blk(Homo sapiens (Human))
East China University Of Science And Technology
US Patent
LigandPNGBDBM195873(US9670213, Compound 018 N-(3-(2-(4-morpholinopheny...)
Affinity DataIC50:  41nMT: 2°C. Assay description: In vitro enzyme activity assay: wild-type and various mutants (T790M, L858R, L861Q, L858 R/T790M) EGFR, Z′-Lyte Kinase Assay Kit were purchased...
Ligand InfoPC cidPC sid
In DepthDetails US Patent
TargetReceptor-type tyrosine-protein kinase FLT3(Homo sapiens (Human))
East China University Of Science & Technology
Curated by ChEMBL
LigandPNGBDBM195873(US9670213, Compound 018 N-(3-(2-(4-morpholinopheny...)
Affinity DataIC50:  1.14E+3nM. Assay description: Inhibition of human N-terminal GST-tagged FLT3 (564 to 993 residues) expressed in baculovirus expression system using peptide FAM-P2 as substrate inc...
Ligand InfoPC cidPC sid
In DepthDetails ArticlePubMed
TargetEpidermal growth factor receptor(Homo sapiens (Human))
East China University Of Science & Technology
Curated by ChEMBL
LigandPNGBDBM195873(US9670213, Compound 018 N-(3-(2-(4-morpholinopheny...)
Affinity DataIC50:  2.90nM. Assay description: Inhibition of EGFR T790M/L858R double mutant (unknown origin) using Tyr 4 peptide as substrate after 1.5 hrs by FRET-based Z'-LYTE assay
Ligand InfoPC cidPC sid
In DepthDetails ArticlePubMed
TargetEpidermal growth factor receptor(Homo sapiens (Human))
East China University Of Science & Technology
Curated by ChEMBL
LigandPNGBDBM195873(US9670213, Compound 018 N-(3-(2-(4-morpholinopheny...)
Affinity DataIC50:  7.30nM. Assay description: Inhibition of EGFR L858R mutant (unknown origin) using Tyr 4 peptide as substrate after 1.5 hrs by FRET-based Z'-LYTE assay
Ligand InfoPC cidPC sid
In DepthDetails ArticlePubMed
TargetEpidermal growth factor receptor(Homo sapiens (Human))
East China University Of Science And Technology
US Patent
LigandPNGBDBM195873(US9670213, Compound 018 N-(3-(2-(4-morpholinopheny...)
Affinity DataIC50:  7nM. Assay description: Inhibition of wild type EGFR (unknown origin) using Tyr 4 peptide as substrate after 1.5 hrs by FRET-based Z'-LYTE assay
Ligand InfoPC cidPC sid
In DepthDetails ArticlePubMed
TargetReceptor-type tyrosine-protein kinase FLT3(Homo sapiens (Human))
East China University Of Science & Technology
Curated by ChEMBL
LigandPNGBDBM195873(US9670213, Compound 018 N-(3-(2-(4-morpholinopheny...)
Affinity DataIC50:  798nMT: 2°C. Assay description: In vitro enzyme activity assay: wild-type and various mutants (T790M, L858R, L861Q, L858 R/T790M) EGFR, Z′-Lyte Kinase Assay Kit were purchased...
Ligand InfoPC cidPC sid
In DepthDetails US Patent