BDBM195885 US9670213, Compound 030 2-(4-aminophenylamino)-8-(4-methoxyphenyl)-7(8H)-pteridin-one
SMILES COc1ccc(cc1)-n1c2nc(Nc3ccc(N)cc3)ncc2ncc1=O
InChI Key InChIKey=SUEFUBDCBOJENJ-UHFFFAOYSA-N
Data  8 IC50
  Tab Delimited (TSV)   2D SDfile   Computed 3D by Vconf -m prep SDfile
Find this compound or compounds like it in BindingDB:
Activity Spreadsheet -- Enzyme Inhibition Constant Data from BindingDB
Found 8 hits for monomerid = 195885
TargetEpidermal growth factor receptor(Homo sapiens (Human))
East China University Of Science And Technology
US Patent
LigandPNGBDBM195885(US9670213, Compound 030 2-(4-aminophenylamino)-8-(...)
Affinity DataIC50:  3.42E+3nMT: 2°C. Assay description: In vitro enzyme activity assay: wild-type and various mutants (T790M, L858R, L861Q, L858 R/T790M) EGFR, Z′-Lyte Kinase Assay Kit were purchased...
Ligand InfoPC cidPC sid
In DepthDetails US Patent
TargetEpidermal growth factor receptor [L858R](Homo sapiens (Human))
East China University Of Science And Technology
US Patent
LigandPNGBDBM195885(US9670213, Compound 030 2-(4-aminophenylamino)-8-(...)
Affinity DataIC50:  2.38E+4nMT: 2°C. Assay description: In vitro enzyme activity assay: wild-type and various mutants (T790M, L858R, L861Q, L858 R/T790M) EGFR, Z′-Lyte Kinase Assay Kit were purchased...
Ligand InfoPC cidPC sid
In DepthDetails US Patent
TargetEpidermal growth factor receptor [T790M,L858R](Homo sapiens (Human))
East China University Of Science And Technology
US Patent
LigandPNGBDBM195885(US9670213, Compound 030 2-(4-aminophenylamino)-8-(...)
Affinity DataIC50:  6.75E+3nMT: 2°C. Assay description: In vitro enzyme activity assay: wild-type and various mutants (T790M, L858R, L861Q, L858 R/T790M) EGFR, Z′-Lyte Kinase Assay Kit were purchased...
Ligand InfoPC cidPC sid
In DepthDetails US Patent
TargetEpidermal growth factor receptor(Homo sapiens (Human))
East China University Of Science & Technology
Curated by ChEMBL
LigandPNGBDBM195885(US9670213, Compound 030 2-(4-aminophenylamino)-8-(...)
Affinity DataIC50:  8.45E+3nM. Assay description: Inhibition of EGFR L858R mutant (unknown origin) using Tyr 4 peptide as substrate after 1.5 hrs by FRET-based Z'-LYTE assay
Ligand InfoPC cidPC sid
In DepthDetails ArticlePubMed
TargetReceptor-type tyrosine-protein kinase FLT3(Homo sapiens (Human))
East China University Of Science And Technology
US Patent
LigandPNGBDBM195885(US9670213, Compound 030 2-(4-aminophenylamino)-8-(...)
Affinity DataIC50:  43nMT: 2°C. Assay description: In vitro enzyme activity assay: wild-type and various mutants (T790M, L858R, L861Q, L858 R/T790M) EGFR, Z′-Lyte Kinase Assay Kit were purchased...
Ligand InfoPC cidPC sid
In DepthDetails US Patent
TargetEpidermal growth factor receptor(Homo sapiens (Human))
East China University Of Science & Technology
Curated by ChEMBL
LigandPNGBDBM195885(US9670213, Compound 030 2-(4-aminophenylamino)-8-(...)
Affinity DataIC50:  6.75E+3nM. Assay description: Inhibition of EGFR T790M/L858R double mutant (unknown origin) using Tyr 4 peptide as substrate after 1.5 hrs by FRET-based Z'-LYTE assay
Ligand InfoPC cidPC sid
In DepthDetails ArticlePubMed
TargetEpidermal growth factor receptor(Homo sapiens (Human))
East China University Of Science And Technology
US Patent
LigandPNGBDBM195885(US9670213, Compound 030 2-(4-aminophenylamino)-8-(...)
Affinity DataIC50:  2.58E+4nM. Assay description: Inhibition of wild type EGFR (unknown origin) using Tyr 4 peptide as substrate after 1.5 hrs by FRET-based Z'-LYTE assay
Ligand InfoPC cidPC sid
In DepthDetails ArticlePubMed
TargetTyrosine-protein kinase Blk(Homo sapiens (Human))
East China University Of Science And Technology
US Patent
LigandPNGBDBM195885(US9670213, Compound 030 2-(4-aminophenylamino)-8-(...)
Affinity DataIC50: >1.00E+4nMT: 2°C. Assay description: In vitro enzyme activity assay: wild-type and various mutants (T790M, L858R, L861Q, L858 R/T790M) EGFR, Z′-Lyte Kinase Assay Kit were purchased...
Ligand InfoPC cidPC sid
In DepthDetails US Patent