BDBM196504 US9212140, C.1
SMILES CO[C@H]1CC[C@]2(CC1)NC(=O)C(=C2)c1cc(ccc1C)-c1ccc(Cl)cc1
InChI Key InChIKey=PKHPLDHMCZUPTF-OKDJAKQTSA-N
Data  4 IC50
  Tab Delimited (TSV)   2D SDfile   Computed 3D by Vconf -m prep SDfile
Find this compound or compounds like it in BindingDB:
Activity Spreadsheet -- Enzyme Inhibition Constant Data from BindingDB
Found 4 hits for monomerid = 196504
TargetAcetyl-CoA carboxylase 1 [39-967](Homo sapiens (Human))
Bayer Intellectual Property
US Patent
LigandPNGBDBM196504(US9212140, C.1)
Affinity DataIC50:  280nMpH: 7.5 T: 2°C. Assay description: Assay A1 (=(A1)): The inhibitory activity of the substances of this invention with regard to acetyl-CoA carboxylase 1 (ACC1) was measured using the A...
Ligand InfoPC cidPC sid
In DepthDetails US Patent
TargetAcetyl-CoA carboxylase 2 [27-967](Homo sapiens (Human))
Bayer Intellectual Property
US Patent
LigandPNGBDBM196504(US9212140, C.1)
Affinity DataIC50:  822nMpH: 7.5 T: 2°C. Assay description: Assay B2 (=(B2)): The hACC2-inhibitory action of the substances of the present invention was measured in the hACC2 assay described in the paragraphs ...
Ligand InfoPC cidPC sid
In DepthDetails US Patent
TargetAcetyl-CoA carboxylase 1 [39-967](Homo sapiens (Human))
Bayer Intellectual Property
US Patent
LigandPNGBDBM196504(US9212140, C.1)
Affinity DataIC50:  84nMpH: 7.5 T: 2°C. Assay description: Assay B1 (=(B1)): The hACC1-inhibitory action of the substances of the present invention was measured in the hACC 1 assay described in the paragraphs...
Ligand InfoPC cidPC sid
In DepthDetails US Patent
TargetAcetyl-CoA carboxylase 2 [39-967](Homo sapiens (Human))
Bayer Intellectual Property
US Patent
LigandPNGBDBM196504(US9212140, C.1)
Affinity DataIC50:  370nMpH: 7.5 T: 2°C. Assay description: Assay A2 (=(A2)): The inhibitory activity of the substances of this invention with regard to acetyl-CoA carboxylase 2 (ACC2) was measured using the A...
Ligand InfoPC cidPC sid
In DepthDetails US Patent