BDBM196514 US9212165, 28
SMILES Cc1nccc(n1)C(=O)N[C@@]12CC[C@@](C1)(CCC2)C#Cc1ccccn1
InChI Key InChIKey=SHBRNDUJRSMILW-RTWAWAEBSA-N
Data  1 KI
  Tab Delimited (TSV)   2D SDfile   Computed 3D by Vconf -m prep SDfile
Find this compound or compounds like it in BindingDB:
Activity Spreadsheet -- Enzyme Inhibition Constant Data from BindingDB
Found 1 hit for monomerid = 196514
TargetMetabotropic glutamate receptor 5(Homo sapiens (Human))
H. Lundbeck
US Patent
LigandPNGBDBM196514(US9212165, 28)
Affinity DataKi:  17nM ΔG°:  -10.6kcal/molepH: 7.4 T: 2°C. Assay description: Binding assays were performed as described in [J. A. O'Brien et al. Mol Pharmacol., 2003, 64, 731-740] with slight modifications, including that ...
Ligand InfoPC cidPC sid
In DepthDetails US Patent