BDBM196567 2-(((2-fluoro-4-methylphenyl)amino)methyl)-5-(4-fluorophenyl)-6,7-dihydropyrazolo[1,5-a]pyrazin-4(5h)-one::US9676782, 35
SMILES Cc1ccc(NCc2cc3C(=O)N(CCn3n2)c2ccc(F)cc2)c(F)c1
InChI Key InChIKey=HBQZCXWSLNEHLD-UHFFFAOYSA-N
Data  2 IC50
  Tab Delimited (TSV)   2D SDfile   Computed 3D by Vconf -m prep SDfile
Find this compound or compounds like it in BindingDB:
Activity Spreadsheet -- Enzyme Inhibition Constant Data from BindingDB
Found 2 hits for monomerid = 196567
TargetMetabotropic glutamate receptor 5(Rattus norvegicus (Rat))
Vanderbilt University
US Patent
LigandPNGBDBM196567(2-(((2-fluoro-4-methylphenyl)amino)methyl)-5-(4-fl...)
Affinity DataIC50:  4.77E+3nMT: 2°C. Assay description: Gα15/TREx cells stably expressing rat mGlu3 were plated in black-walled, clear-bottomed, poly-D-lysine coated 384-well plates in 20 μL of a...
Ligand InfoPC cidPC sid
In DepthDetails US Patent
TargetMetabotropic glutamate receptor 3(Rattus norvegicus (Rat))
Vanderbilt University
US Patent
LigandPNGBDBM196567(2-(((2-fluoro-4-methylphenyl)amino)methyl)-5-(4-fl...)
Affinity DataIC50:  799nMT: 2°C. Assay description: HEK 293A cells stably expressing rat mGlu5 were plated in black-walled, clear-bottomed, poly-D-lysine coated 384-well plates in 20 μL of assay m...
Ligand InfoPC cidPC sid
In DepthDetails US Patent