BDBM196697 US9212171, 22
SMILES CN1CCCCC(c2ccc(cn2)C#Cc2ccccc2)C1=O
InChI Key InChIKey=IUDGZOINZXJCGK-UHFFFAOYSA-N
Data  1 EC50
  Tab Delimited (TSV)   2D SDfile   Computed 3D by Vconf -m prep SDfile
Find this compound or compounds like it in BindingDB:
Activity Spreadsheet -- Enzyme Inhibition Constant Data from BindingDB
Found 1 hit for monomerid = 196697
TargetIsoform 1 of Metabotropic glutamate receptor 5 (5a)(Homo sapiens (Human))
Hoffmann-La Roche
US Patent
LigandPNGBDBM196697(US9212171, 22)
Affinity DataEC50:  59nMT: 2°C. Assay description: A monoclonal HEK-293 cell line stably transfected with a cDNA encoding for the human mGlu5a receptor was generated; for the work with mGlu5 Positive ...
Ligand InfoPC cidPC sid
In DepthDetails US Patent