BDBM1967 (Alkylamino)piperidine BHAP Analog 23::1-[[5-[[(4-Methyl-1-piperazinyl)carbonyl]amino]indol-2-yl]carbonyl]-4-[N-ethyl-N-[3-(ethylamino)-2-pyridinyl]amino]piperidine::N-{2-[(4-{ethyl[3-(ethylamino)pyridin-2-yl]amino}piperidin-1-yl)carbonyl]-1H-indol-5-yl}-4-methylpiperazine-1-carboxamide
SMILES CCNc1cccnc1N(CC)C1CCN(CC1)C(=O)c1cc2cc(NC(=O)N3CCN(C)CC3)ccc2[nH]1
InChI Key InChIKey=ZICISMADASVWBX-UHFFFAOYSA-N
Data  3 IC50
  Tab Delimited (TSV)   2D SDfile   Computed 3D by Vconf -m prep SDfile
Find this compound or compounds like it in BindingDB:
Activity Spreadsheet -- Enzyme Inhibition Constant Data from BindingDB
Found 3 hits for monomerid = 1967
TargetGag-Pol polyprotein [588-1027]/[588-1147](Human immunodeficiency virus type 1)
Upjohn
LigandPNGBDBM1967((Alkylamino)piperidine BHAP Analog 23 | 1-[[5-[[(4...)
Affinity DataIC50:  140nMpH: 8.3 T: 2°C. Assay description: The IC50 of reverse transcriptase is the concentration that inhibits 50% of recombinant HIV-1 RT RNA-directed DNA polymerase activity in vitro.
In DepthDetails ArticlePubMed
TargetGag-Pol polyprotein [588-1127,Y768C]/[588-1147,Y768C](Human immunodeficiency virus type 1)
Upjohn
LigandPNGBDBM1967((Alkylamino)piperidine BHAP Analog 23 | 1-[[5-[[(4...)
Affinity DataIC50:  1.23E+3nM. Assay description: The IC50 of reverse transcriptase is the concentration that inhibits 50% of recombinant HIV-1 RT RNA-directed DNA polymerase activity in vitro.
In DepthDetails ArticlePubMed
TargetGag-Pol polyprotein [588-1027,P823L]/[588-1147,P823L](Human immunodeficiency virus type 1)
Upjohn
LigandPNGBDBM1967((Alkylamino)piperidine BHAP Analog 23 | 1-[[5-[[(4...)
Affinity DataIC50:  240nM. Assay description: The IC50 of reverse transcriptase is the concentration that inhibits 50% of recombinant HIV-1 RT RNA-directed DNA polymerase activity in vitro.
In DepthDetails ArticlePubMed