BDBM196717 US9212171, 39
SMILES CN1[C@H]2CCCC[C@H]2[C@H](C1=O)c1ccc(cn1)C#Cc1cccc(F)c1
InChI Key InChIKey=ANKHAIGVTCEXMT-GIVPXCGWSA-N
Data  1 EC50
  Tab Delimited (TSV)   2D SDfile   Computed 3D by Vconf -m prep SDfile
Find this compound or compounds like it in BindingDB:
Activity Spreadsheet -- Enzyme Inhibition Constant Data from BindingDB
Found 1 hit for monomerid = 196717
TargetIsoform 1 of Metabotropic glutamate receptor 5 (5a)(Homo sapiens (Human))
Hoffmann-La Roche
US Patent
LigandPNGBDBM196717(US9212171, 39)
Affinity DataEC50:  141nMT: 2°C. Assay description: A monoclonal HEK-293 cell line stably transfected with a cDNA encoding for the human mGlu5a receptor was generated; for the work with mGlu5 Positive ...
Ligand InfoPC cidPC sid
In DepthDetails US Patent