BDBM196935 US9212196, Derivative 31
SMILES COc1cc(CP(O)(=O)CC[C@@H](N)C(O)=O)ccc1OCC(O)=O
InChI Key InChIKey=DROSYWQBEHIXTD-SNVBAGLBSA-N
Data  2 EC50
  Tab Delimited (TSV)   2D SDfile   Computed 3D by Vconf -m prep SDfile
Find this compound or compounds like it in BindingDB:
Activity Spreadsheet -- Enzyme Inhibition Constant Data from BindingDB
Found 2 hits for monomerid = 196935
TargetMetabotropic glutamate receptor 8(Rattus norvegicus (Rat))
Universite Paris Descartes
US Patent
LigandPNGBDBM196935(US9212196, Derivative 31)
Affinity DataEC50: >3.00E+5nM. Assay description: Metabotropic glutamate receptors were transiently transfected in HEK293 cells by electroporation as described elsewhere (Brabet I. et al., 1998) and ...
Ligand InfoPC cidPC sid
In DepthDetails US Patent
TargetMetabotropic glutamate receptor 4(Rattus norvegicus (Rat))
Universite Paris Descartes
US Patent
LigandPNGBDBM196935(US9212196, Derivative 31)
Affinity DataEC50:  7.41E+3nM. Assay description: Metabotropic glutamate receptors were transiently transfected in HEK293 cells by electroporation as described elsewhere (Brabet I. et al., 1998) and ...
Ligand InfoPC cidPC sid
In DepthDetails US Patent