BDBM197176 US9090621, 1::US9572811, Example 1
SMILES Nc1ncnc2n(nc(-c3ccc(Oc4ccccc4)cc3)c12)C1CCCN(C1)C(=O)C(=CC1CC1)C#N
InChI Key InChIKey=SKHARCJJALHOPW-UHFFFAOYSA-N
Data  2 IC50
  Tab Delimited (TSV)   2D SDfile   Computed 3D by Vconf -m prep SDfile
Find this compound or compounds like it in BindingDB:
Activity Spreadsheet -- Enzyme Inhibition Constant Data from BindingDB
Found 2 hits for monomerid = 197176
TargetTyrosine-protein kinase BTK(Homo sapiens (Human))
Principia Biopharma
US Patent
LigandPNGBDBM197176(US9090621, 1 | US9572811, Example 1)
Affinity DataIC50:  3.10nMT: 2°C. Assay description: A Caliper-based kinase assay (Caliper Life Sciences, Hopkinton, Mass.) was used to measure inhibition of Btk kinase activity of a compound of Formula...
Ligand InfoPC cidPC sid
In DepthDetails US Patent
TargetTyrosine-protein kinase BTK(Homo sapiens (Human))
Principia Biopharma
US Patent
LigandPNGBDBM197176(US9090621, 1 | US9572811, Example 1)
Affinity DataIC50:  3.10nMT: 2°C. Assay description: A Caliper-based kinase assay (Caliper Life Sciences, Hopkinton, Mass.) was used to measure inhibition of Btk kinase activity of a compound of Formula...
Ligand InfoPC cidPC sid
In DepthDetails US Patent