BDBM197700 US9216981, 29
SMILES Fc1ccc(NS(=O)(=O)c2cccc(Cl)c2F)c(F)c1Nc1ncccc1-c1ncnc2[nH]cnc12
InChI Key InChIKey=PXGZTGOCMAAVGO-UHFFFAOYSA-N
Data  1 IC50  1 EC50
  Tab Delimited (TSV)   2D SDfile   Computed 3D by Vconf -m prep SDfile
Find this compound or compounds like it in BindingDB:
Activity Spreadsheet -- Enzyme Inhibition Constant Data from BindingDB
Found 2 hits for monomerid = 197700
TargetSerine/threonine-protein kinase B-raf(Homo sapiens (Human))
Medpacto
US Patent
LigandPNGBDBM197700(US9216981, 29)
Affinity DataEC50:  720nMT: 2°C. Assay description: To check the B-Raf cell activity inhibitory capability of the compounds of the present invention, the following experiments were conducted in A375P...
Ligand InfoPC cidPC sid
In DepthDetails US Patent
TargetSerine/threonine-protein kinase B-raf(Homo sapiens (Human))
Medpacto
US Patent
LigandPNGBDBM197700(US9216981, 29)
Affinity DataIC50:  80nMpH: 7.2 T: 2°C. Assay description: To check the B-Raf kinase inhibitory activity of the compounds of the present invention, the following experiments were conducted.(1) Serial Signalin...
Ligand InfoPC cidPC sid
In DepthDetails US Patent