BDBM197745 US9216986, 4-Methoxy-2-[2-(8-methoxy-5-methyl-[1,2,4]triazolo[1,5-a]pyridin-2-yl)-ethyl]-quinoline::US9801878, 4-Methoxy-2-[2-(8-methoxy-5-methyl-[1,2,4]triazolo[1,5-a]pyridin-2-yl)-ethyl]-quinoline
SMILES COc1ccc(C)n2nc(CCc3cc(OC)c4ccccc4n3)nc12
InChI Key InChIKey=MOCHHWZVRUMXSG-UHFFFAOYSA-N
Data  2 IC50
  Tab Delimited (TSV)   2D SDfile   Computed 3D by Vconf -m prep SDfile
Find this compound or compounds like it in BindingDB:
Activity Spreadsheet -- Enzyme Inhibition Constant Data from BindingDB
Found 2 hits for monomerid = 197745
TargetcAMP and cAMP-inhibited cGMP 3',5'-cyclic phosphodiesterase 10A(Homo sapiens (Human))
H. Lundbeck
US Patent
LigandPNGBDBM197745(US9216986, 4-Methoxy-2-[2-(8-methoxy-5-methyl-[1,2...)
Affinity DataIC50:  270nM. Assay description: A PDE10A assay may for example, be performed as follows: The assay is performed in 60 uL samples containing a fixed amount of the relevant PDE enzyme...
Ligand InfoPC cidPC sid
In DepthDetails US Patent
TargetcAMP and cAMP-inhibited cGMP 3',5'-cyclic phosphodiesterase 10A [440-779](Homo sapiens (Human))
H. Lundbeck
US Patent
LigandPNGBDBM197745(US9216986, 4-Methoxy-2-[2-(8-methoxy-5-methyl-[1,2...)
Affinity DataIC50:  35nMT: 2°C. Assay description: A PDE10A assay may for example, be performed as follows: The assay is performed in 60 uL samples containing a fixed amount of the relevant PDE enzyme...
Ligand InfoPC cidPC sid
In DepthDetails US Patent