BDBM198149 1-(4-(4-Chlorophenyl)-6-methyl-2-thioxo-3,4-tetrahydropyrimidin-5-yl)ethanone (1e)
SMILES CC(=O)C1=C(C)NC(=S)NC1c1ccc(Cl)cc1
InChI Key InChIKey=WNPVOABUHCFDOF-UHFFFAOYSA-N
Data  1 IC50
  Tab Delimited (TSV)   2D SDfile   Computed 3D by Vconf -m prep SDfile
Find this compound or compounds like it in BindingDB:
Activity Spreadsheet -- Enzyme Inhibition Constant Data from BindingDB
Found 1 hit for monomerid = 198149
TargetAcetylcholinesterase(Electrophorus electricus (Electric eel))
Hazara University
LigandPNGBDBM198149(1-(4-(4-Chlorophenyl)-6-methyl-2-thioxo-3,4-tetrah...)
Affinity DataIC50:  5.99E+4nMpH: 8.0Assay Description:The synthesized compounds (each separately) were dissolved in a mixture of DMSO (1 ml) and methanol (9 ml) and then diluted in KH2PO4/K2HPO4 buffer (...
Ligand InfoPC cidPC sid
In DepthDetails ArticlePubMed