BDBM19824 (1R,2R)-N-(cyanomethyl)-2-{[(4-hydroxyphenyl)sulfanyl]methyl}cyclohexane-1-carboxamide::Cyclohexanecarboxamide derivative, 12h::racemic mixture
SMILES Oc1ccc(SC[C@@H]2CCCC[C@H]2C(=O)NCC#N)cc1
InChI Key InChIKey=PDFPDVMIGJMOAQ-SWLSCSKDSA-N
Data  1 IC50
  Tab Delimited (TSV)   2D SDfile   Computed 3D by Vconf -m prep SDfile
Find this compound or compounds like it in BindingDB:
Activity Spreadsheet -- Enzyme Inhibition Constant Data from BindingDB
Found 1 hit for monomerid = 19824
TargetCathepsin K(Oryctolagus cuniculus (rabbit))
Merck Frosst Centre For Therapeutic Research
LigandPNGBDBM19824((1R,2R)-N-(cyanomethyl)-2-{[(4-hydroxyphenyl)sulfa...)
Affinity DataIC50:  21nMpH: 5.5 T: 2°C. Assay description: Prior to the addition of substrate, different concentrations of the inhibitor ranging from 100 uM to 0.2 nM were preincubated for 15 min with enzyme ...
In DepthDetails ArticlePubMed