BDBM198487 US9216999, 284::US9556187, Example 284
SMILES C(NC1CCCC1)[C@H]1CC[C@@H](CC1)c1nnn2cnc3[nH]ccc3c12
InChI Key
Data  7 IC50
  Tab Delimited (TSV)   2D SDfile   Computed 3D by Vconf -m prep SDfile
Find this compound or compounds like it in BindingDB:
Activity Spreadsheet -- Enzyme Inhibition Constant Data from BindingDB
Found 7 hits for monomerid = 198487
TargetTyrosine-protein kinase JAK2(Homo sapiens (Human))
Nissan Chemical Industries
US Patent
LigandPNGBDBM198487(US9216999, 284 | US9556187, Example 284)
Affinity DataIC50:  150nMpH: 7.5Assay Description:JAK1, JAK2, JAK3 and Tyk2 were purchased from Carna Biosciences, Inc. As the substrate, LANCE Ultra ULight-JAK1 Peptide (manufactured by PerkinElmer ...
Ligand InfoPC cidPC sid
In DepthDetails US Patent
TargetTyrosine-protein kinase JAK3(Homo sapiens (Human))
Nissan Chemical Industries
US Patent
LigandPNGBDBM198487(US9216999, 284 | US9556187, Example 284)
Affinity DataIC50: >1.00E+3nMpH: 7.5Assay Description:JAK1, JAK2, JAK3 and Tyk2 were purchased from Carna Biosciences, Inc. As the substrate, LANCE Ultra ULight-JAK1 Peptide (manufactured by PerkinElmer ...
Ligand InfoPC cidPC sid
In DepthDetails US Patent
TargetNon-receptor tyrosine-protein kinase TYK2(Homo sapiens (Human))
Nissan Chemical Industries
US Patent
LigandPNGBDBM198487(US9216999, 284 | US9556187, Example 284)
Affinity DataIC50:  320nMpH: 7.5Assay Description:JAK1, JAK2, JAK3 and Tyk2 were purchased from Carna Biosciences, Inc. As the substrate, LANCE Ultra ULight-JAK1 Peptide (manufactured by PerkinElmer ...
Ligand InfoPC cidPC sid
In DepthDetails US Patent
TargetNon-receptor tyrosine-protein kinase TYK2(Homo sapiens (Human))
Nissan Chemical Industries
US Patent
LigandPNGBDBM198487(US9216999, 284 | US9556187, Example 284)
Affinity DataIC50:  320nMT: 2°C. Assay description: JAK1, JAK2, JAK3 and Tyk2 were purchased from Carna Biosciences, Inc. As the substrate, LANCE Ultra ULight-JAK1 Peptide (manufactured by PerkinElmer ...
Ligand InfoPC cidPC sid
In DepthDetails US Patent
TargetTyrosine-protein kinase JAK1(Homo sapiens (Human))
Nissan Chemical Industries
US Patent
LigandPNGBDBM198487(US9216999, 284 | US9556187, Example 284)
Affinity DataIC50:  17nMT: 2°C. Assay description: JAK1, JAK2, JAK3 and Tyk2 were purchased from Carna Biosciences, Inc. As the substrate, LANCE Ultra ULight-JAK1 Peptide (manufactured by PerkinElmer ...
Ligand InfoPC cidPC sid
In DepthDetails US Patent
TargetTyrosine-protein kinase JAK2(Homo sapiens (Human))
Nissan Chemical Industries
US Patent
LigandPNGBDBM198487(US9216999, 284 | US9556187, Example 284)
Affinity DataIC50:  150nMT: 2°C. Assay description: JAK1, JAK2, JAK3 and Tyk2 were purchased from Carna Biosciences, Inc. As the substrate, LANCE Ultra ULight-JAK1 Peptide (manufactured by PerkinElmer ...
Ligand InfoPC cidPC sid
In DepthDetails US Patent
TargetTyrosine-protein kinase JAK1(Homo sapiens (Human))
Nissan Chemical Industries
US Patent
LigandPNGBDBM198487(US9216999, 284 | US9556187, Example 284)
Affinity DataIC50:  17nMpH: 7.5Assay Description:JAK1, JAK2, JAK3 and Tyk2 were purchased from Carna Biosciences, Inc. As the substrate, LANCE Ultra ULight-JAK1 Peptide (manufactured by PerkinElmer ...
Ligand InfoPC cidPC sid
In DepthDetails US Patent