BDBM198907 US9221797, 150
SMILES CC1(C)CCC(=CC1)c1cc(CN2CCN(CCO)CC2)ccc1NC(=O)c1nc(c[nH]1)C#N
InChI Key InChIKey=ZRBHOXZJRFQVDF-UHFFFAOYSA-N
Data  1 IC50
  Tab Delimited (TSV)   2D SDfile   Computed 3D by Vconf -m prep SDfile
Find this compound or compounds like it in BindingDB:
Activity Spreadsheet -- Enzyme Inhibition Constant Data from BindingDB
Found 1 hit for monomerid = 198907
TargetMacrophage colony-stimulating factor 1 receptor [555-568](Homo sapiens (Human))
Janssen Pharmaceutica
US Patent
LigandPNGBDBM198907(US9221797, 150)
Affinity DataIC50:  0.75nMpH: 7.5Assay Description:A fluorescence polarization competition immunoassay was used to measure compound inhibition of CSF-1R phosphorylation of tyrosine on a synthetic CS...
Ligand InfoPC cidPC sid
In DepthDetails US Patent