BDBM198936 US9676786, example 5
SMILES CC(C)c1cc(cc(C(C)C)c1O)C(O)=O
InChI Key InChIKey=WYAZPCLFZZTVSP-UHFFFAOYSA-N
Data  1 EC50
  Tab Delimited (TSV)   2D SDfile   Computed 3D by Vconf -m prep SDfile
Find this compound or compounds like it in BindingDB:
Activity Spreadsheet -- Enzyme Inhibition Constant Data from BindingDB
Found 1 hit for monomerid = 198936
TargetGlycine receptor subunit alpha-1(Homo sapiens (Human))
The University Of Liverpool
US Patent
LigandPNGBDBM198936(US9676786, example 5)
Affinity DataEC50:  0.000160nM. Assay description: Human embryonic kidney (HEK) 293 cells (ATCC CRL 1573) and/or Xenopus laevis oocytes were used for expressing the human a1-3 glycine receptor subunit...
In DepthDetails US Patent