BDBM199087 US9221839, 1
SMILES CN1C(=N)N[C@]2(COC[C@H]2S1(=O)=O)c1cc(NC(=O)c2ccc(F)cn2)ccc1F
InChI Key InChIKey=FEUVBQUAABZEJQ-CRAIPNDOSA-N
Data  2 KI
  Tab Delimited (TSV)   2D SDfile   Computed 3D by Vconf -m prep SDfile
Find this compound or compounds like it in BindingDB:
Activity Spreadsheet -- Enzyme Inhibition Constant Data from BindingDB
Found 2 hits for monomerid = 199087
TargetBeta-secretase 2(Homo sapiens (Human))
Merck Sharp & Dohme
US Patent
LigandPNGBDBM199087(US9221839, 1)
Affinity DataKi:  1.90nM ΔG°:  -12.1kcal/molepH: 5.0 T: 2°C. Assay description: Inhibitor IC50s at purified human autoBACE-2 are determined in a time-resolved endpoint proteolysis assay that measures hydrolysis of the QSY7-EISE...
Ligand InfoPC cidPC sid
In DepthDetails US Patent
TargetBeta-secretase 1(Homo sapiens (Human))
Merck Sharp & Dohme
US Patent
LigandPNGBDBM199087(US9221839, 1)
Affinity DataKi:  13nM ΔG°:  -10.9kcal/molepH: 5.0 T: 2°C. Assay description: A homogeneous time-resolved FRET assay can be used to determine IC50 values for inhibitors of the soluble human BACE1 catalytic domain. This assay ...
Ligand InfoPC cidPC sid
In DepthDetails US Patent