BDBM199128 N-(4-(1-(4,6-dimorpholino-1,3,5-triazin-2-yl)-5-(4-methoxyphenyl)-1H-pyrazol-3-yl)phenyl)-4-methylbenzenesulphonamide (8j)
SMILES COc1ccc(cc1)-c1cc(nn1-c1nc(nc(n1)N1CCOCC1)N1CCOCC1)-c1ccc(NS(=O)(=O)c2ccc(C)cc2)cc1
InChI Key InChIKey=OKYXSKLVVYTSBT-UHFFFAOYSA-N
Data  2 IC50
  Tab Delimited (TSV)   2D SDfile   Computed 3D by Vconf -m prep SDfile
Find this compound or compounds like it in BindingDB:
Activity Spreadsheet -- Enzyme Inhibition Constant Data from BindingDB
Found 2 hits for monomerid = 199128
TargetMatrix metalloproteinase-9(Rattus norvegicus (Rat))
Zhejiang Hospital
LigandPNGBDBM199128(N-(4-(1-(4,6-dimorpholino-1,3,5-triazin-2-yl)-5-(4...)
Affinity DataIC50:  31.2nMpH: 7.5 T: 2°C. Assay description: where a pro-fluorescing peptide is used as substrate, and the fluorogenic activity of its cleavage product is measured after co-incubation with the a...
Ligand InfoPC cidPC sid
In DepthDetails ArticlePubMed
Target72 kDa type IV collagenase(Rattus norvegicus (Rat))
Zhejiang Hospital
LigandPNGBDBM199128(N-(4-(1-(4,6-dimorpholino-1,3,5-triazin-2-yl)-5-(4...)
Affinity DataIC50:  42.3nMpH: 7.5 T: 2°C. Assay description: where a pro-fluorescing peptide is used as substrate, and the fluorogenic activity of its cleavage product is measured after co-incubation with the a...
Ligand InfoPC cidPC sid
In DepthDetails ArticlePubMed