BDBM199330 US9676818, 45
SMILES CCCCCCCCCCCCCCCCNC(=O)OCCSC[C@H](NC(C)=O)C(=O)N[C@@H](CO)C(=O)OC
InChI Key InChIKey=TWGUPQZOHKWPKP-DQEYMECFSA-N
Data  1 EC50
  Tab Delimited (TSV)   2D SDfile   Computed 3D by Vconf -m prep SDfile
Find this compound or compounds like it in BindingDB:
Activity Spreadsheet -- Enzyme Inhibition Constant Data from BindingDB
Found 1 hit for monomerid = 199330
TargetToll-like receptor 2(Homo sapiens (Human))
University Of Kansas
US Patent
LigandPNGBDBM199330(US9676818, 45)
Affinity DataEC50:  323nM. Assay description: The induction of NF-κB in a TLR2-specific reporter gene assay was quantified using HEK-BLUE™ cells as previously described (Wu, W. et al., ...
Ligand InfoPC cidPC sid
In DepthDetails US Patent