BDBM199503 5-fluoro-n-((1r,5s,7s)-9-methyl-3-oxa-9- azabicyclo[3.3.1]nonan-7-yl)-1-(pyridin-3- yl)-1h-pyrrolo[2,3-b]pyridine-3- carboxamide, 2,2,2-trifluoroacetic acid salt::US9670229, 14
SMILES CN1C2COCC1CC(C2)NC(=O)c1nn(-c2ccccn2)c2ncccc12
InChI Key InChIKey=ZZNXNWSGGQDTEE-UHFFFAOYSA-N
Data  1 IC50
  Tab Delimited (TSV)   2D SDfile   Computed 3D by Vconf -m prep SDfile
Find this compound or compounds like it in BindingDB:
Activity Spreadsheet -- Enzyme Inhibition Constant Data from BindingDB
Found 1 hit for monomerid = 199503
Target5-hydroxytryptamine receptor 3A(Homo sapiens (Human))
Takeda Pharmaceutical
US Patent
LigandPNGBDBM199503(5-fluoro-n-((1r,5s,7s)-9-methyl-3-oxa-9- azabicycl...)
Affinity DataIC50:  1.34nMT: 2°C. Assay description: The 5-HT3 antagonist activity of the compounds of the invention was determined by measuring the ability of the compounds to inhibit the calcium flux ...
Ligand InfoPC cidPC sid
In DepthDetails US Patent