BDBM200195 US9234000, 186
SMILES CCOc1ccc(C[C@@H](NC(=O)c2[nH]ccc2C)C(=O)N[C@@H](Cc2csc3ccccc23)C(=O)NCc2ccc(CN)cc2)cc1
InChI Key InChIKey=GCTFSBZKSCJATJ-JSOSNVBQSA-N
Data  3 IC50
  Tab Delimited (TSV)   2D SDfile   Computed 3D by Vconf -m prep SDfile
Find this compound or compounds like it in BindingDB:
Activity Spreadsheet -- Enzyme Inhibition Constant Data from BindingDB
Found 3 hits for monomerid = 200195
TargetPlasma kallikrein(Homo sapiens (Human))
Kalvista Pharmaceuticals
US Patent
LigandPNGBDBM200195(US9234000, 186)
Affinity DataIC50:  14nM. Assay description: Plasma kallikrein inhibitory activity in vitro was determined using standard published methods (see e.g. Johansen et al., Int. J. Tiss. Reac. 1986, 8...
Ligand InfoPC cidPC sid
In DepthDetails US Patent
TargetCoagulation factor XII(Homo sapiens (Human))
Kalvista Pharmaceuticals
US Patent
LigandPNGBDBM200195(US9234000, 186)
Affinity DataIC50: >1.00E+4nM. Assay description: Human serine protease enzymes plasmin, thrombin, trypsin, Factor Xa and Factor XIIa were assayed for enzymatic activity using an appropriate fluoroge...
Ligand InfoPC cidPC sid
In DepthDetails US Patent
TargetKallikrein-1(Homo sapiens (Human))
Kalvista Pharmaceuticals
US Patent
LigandPNGBDBM200195(US9234000, 186)
Affinity DataIC50:  3.80E+3nM. Assay description: KLK1 inhibitory activity in vitro was determined using standard published methods (see e.g. Johansen et al., Int. J. Tiss. Reac. 1986, 8, 185; Shori ...
Ligand InfoPC cidPC sid
In DepthDetails US Patent