BDBM200243 AB00984190-01::cid_16377116
SMILES Cc1ccc(\C=C\C2=Cc3c(C#N)c(NC(=O)CN4CCOCC4)sc3C(C)(C)C2)o1
InChI Key InChIKey=UNMRUEDTPSQZDL-FNORWQNLSA-N
Data  1 EC50
  Tab Delimited (TSV)   2D SDfile   Computed 3D by Vconf -m prep SDfile
Find this compound or compounds like it in BindingDB:
Activity Spreadsheet -- Enzyme Inhibition Constant Data from BindingDB
Found 1 hit for monomerid = 200243
TargetCystic fibrosis transmembrane conductance regulator(Homo sapiens (Human))
Southern Research Institute
Curated by PubChem BioAssay
LigandPNGBDBM200243(AB00984190-01 | cid_16377116)
Affinity DataEC50: >4.60E+4nM
In DepthDetails PCBioAssay