BDBM200265 AB00986286-01::cid_17417823
SMILES Clc1ccc2c(c1)[nH]c(CSC1=NCCN1)nc2=O
InChI Key InChIKey=PSJPSQREYMMRFI-UHFFFAOYSA-N
Data  1 EC50
  Tab Delimited (TSV)   2D SDfile   Computed 3D by Vconf -m prep SDfile
Find this compound or compounds like it in BindingDB:
Activity Spreadsheet -- Enzyme Inhibition Constant Data from BindingDB
Found 1 hit for monomerid = 200265
TargetCystic fibrosis transmembrane conductance regulator(Homo sapiens (Human))
Southern Research Institute
Curated by PubChem BioAssay
LigandPNGBDBM200265(AB00986286-01 | cid_17417823)
Affinity DataEC50: >6.80E+4nM
In DepthDetails PCBioAssay