BDBM200454 US10011599, Example 83::US9227969, 83::US9629836, 83
SMILES Cc1ccnc(Oc2ccc(c(F)c2)-c2cc3c4n(cnc4cnc3cc2F)C2(C)CCN(CC2)C(=O)CO)n1
InChI Key InChIKey=GTCQTDKQZUQUNF-UHFFFAOYSA-N
Data  3 IC50
  Tab Delimited (TSV)   2D SDfile   Computed 3D by Vconf -m prep SDfile
Find this compound or compounds like it in BindingDB:
Activity Spreadsheet -- Enzyme Inhibition Constant Data from BindingDB
Found 3 hits for monomerid = 200454
LigandPNGBDBM200454(US10011599, Example 83 | US9227969, 83 | US9629836...)
Affinity DataIC50:  47nMpH: 7.5Assay Description:A BRAF-MEK-ERK cascade assay is used to evaluate the effects of these compounds as inhibitors of the MAP kinase pathway. An enzymatic cascade assay i...
Ligand InfoPC cidPC sid
In DepthDetails US Patent
TargetDual specificity mitogen-activated protein kinase kinase 1(Homo sapiens (Human))
Novartis
US Patent
LigandPNGBDBM200454(US10011599, Example 83 | US9227969, 83 | US9629836...)
Affinity DataIC50:  47nM. Assay description: [MEK1 1mM ATP IC50 uM] A BRAF-MEK-ERK cascade assay is used to evaluate the effects of these compounds as inhibitors of the MAP kinase pathway. An en...
Ligand InfoPC cidPC sid
In DepthDetails US Patent
TargetDual specificity mitogen-activated protein kinase kinase 1 [K97R](Homo sapiens (Human))
Novartis
US Patent
LigandPNGBDBM200454(US10011599, Example 83 | US9227969, 83 | US9629836...)
Affinity DataIC50:  47nM. Assay description: The radioactive filter binding assay is standardized using recombinant human activated BRAF (V599E) kinase (Cat No. 14-557) and kinase dead MEK1 (K97...
Ligand InfoPC cidPC sid
In DepthDetails US Patent