BDBM200463 US10011599, Example 92::US9227969, 92::US9629836, 92
SMILES Cc1nc2cnc3cc(F)c(cc3c2n1[C@H]1CCN(C[C@@H]1F)C(=O)CO)-c1ccc(Oc2ncccn2)cc1F
InChI Key InChIKey=ZPMQDIWQRVJMFE-DHLKQENFSA-N
Data  3 IC50
  Tab Delimited (TSV)   2D SDfile   Computed 3D by Vconf -m prep SDfile
Find this compound or compounds like it in BindingDB:
Activity Spreadsheet -- Enzyme Inhibition Constant Data from BindingDB
Found 3 hits for monomerid = 200463
LigandPNGBDBM200463(US10011599, Example 92 | US9227969, 92 | US9629836...)
Affinity DataIC50:  32nMpH: 7.5Assay Description:A BRAF-MEK-ERK cascade assay is used to evaluate the effects of these compounds as inhibitors of the MAP kinase pathway. An enzymatic cascade assay i...
Ligand InfoPC cidPC sid
In DepthDetails US Patent
TargetDual specificity mitogen-activated protein kinase kinase 1(Homo sapiens (Human))
Novartis
US Patent
LigandPNGBDBM200463(US10011599, Example 92 | US9227969, 92 | US9629836...)
Affinity DataIC50:  32nM. Assay description: [MEK1 1mM ATP IC50 uM] A BRAF-MEK-ERK cascade assay is used to evaluate the effects of these compounds as inhibitors of the MAP kinase pathway. An en...
Ligand InfoPC cidPC sid
In DepthDetails US Patent
TargetDual specificity mitogen-activated protein kinase kinase 1 [K97R](Homo sapiens (Human))
Novartis
US Patent
LigandPNGBDBM200463(US10011599, Example 92 | US9227969, 92 | US9629836...)
Affinity DataIC50:  32nM. Assay description: The radioactive filter binding assay is standardized using recombinant human activated BRAF (V599E) kinase (Cat No. 14-557) and kinase dead MEK1 (K97...
Ligand InfoPC cidPC sid
In DepthDetails US Patent