BDBM200587 US10011604, 14::US10590139, Example 14::US9227975, 14::US9795611, 14
SMILES CC(C)(C)OC(=O)NC1CN(C1)C(=O)Nc1cnc2ccc(nn12)N1CCC[C@@H]1c1cc(F)ccc1F
InChI Key InChIKey=SWJIQPPGWGNTMW-LJQANCHMSA-N
Data  5 IC50
  Tab Delimited (TSV)   2D SDfile   Computed 3D by Vconf -m prep SDfile
Find this compound or compounds like it in BindingDB:
Activity Spreadsheet -- Enzyme Inhibition Constant Data from BindingDB
Found 5 hits for monomerid = 200587
TargetHigh affinity nerve growth factor receptor(Homo sapiens (Human))
Array Biopharma
US Patent
LigandPNGBDBM200587(US10011604, 14 | US10590139, Example 14 | US922797...)
Affinity DataIC50:  23.2nMpH: 7.5Assay Description:An enzyme-linked immunosorbant assay (ELISA) was used to assess TrkA kinase activity in the presence of inhibitors. Immulon 4HBX 384-well microtiter ...
Ligand InfoPC cidPC sid
In DepthDetails US Patent
TargetHigh affinity nerve growth factor receptor(Homo sapiens (Human))
Array Biopharma
US Patent
LigandPNGBDBM200587(US10011604, 14 | US10590139, Example 14 | US922797...)
Affinity DataIC50:  23.2nM. Assay description: Trk enzymatic selectivity was assessed using Omnia Kinase Assay reagents from Invitrogen Corp. Enzyme (either TrkA or TrkB from Invitrogen Corp.) and...
Ligand InfoPC cidPC sid
In DepthDetails US Patent
TargetHigh affinity nerve growth factor receptor(Homo sapiens (Human))
Array Biopharma
US Patent
LigandPNGBDBM200587(US10011604, 14 | US10590139, Example 14 | US922797...)
Affinity DataIC50:  23.2nM. Assay description: An enzyme-linked immunosorbant assay (ELISA) was used to assess TrkA kinase activity in the presence of inhibitors. Immulon 4HBX 384-well microtiter ...
Ligand InfoPC cidPC sid
In DepthDetails US Patent
TargetHigh affinity nerve growth factor receptor(Homo sapiens (Human))
Array Biopharma
US Patent
LigandPNGBDBM200587(US10011604, 14 | US10590139, Example 14 | US922797...)
Affinity DataIC50:  23.2nM. Assay description: An enzyme-linked immunosorbant assay (ELISA) was used to assess TrkA kinase activity in the presence of inhibitors. Immulon 4HBX 384-well microtiter ...
Ligand InfoPC cidPC sid
In DepthDetails US Patent
TargetHigh affinity nerve growth factor receptor(Homo sapiens (Human))
Array Biopharma
US Patent
LigandPNGBDBM200587(US10011604, 14 | US10590139, Example 14 | US922797...)
Affinity DataIC50:  23.2nM. Assay description: An enzyme-linked immunosorbant assay (ELISA) was used to assess TrkA kinase activity in the presence of inhibitors. Immulon 4HBX 384-well microtiter ...
Ligand InfoPC cidPC sid
In DepthDetails US Patent