BDBM200651 US9233086, 2A
SMILES CCCC[C@H](NC(=O)[C@H](C)NC(C)=O)C(=O)N[C@@H](C)C(N)=O
InChI Key InChIKey=PPQYFNFSTMEOPX-QXEWZRGKSA-N
Data  1 IC50
  Tab Delimited (TSV)   2D SDfile   Computed 3D by Vconf -m prep SDfile
Find this compound or compounds like it in BindingDB:
Activity Spreadsheet -- Enzyme Inhibition Constant Data from BindingDB
Found 1 hit for monomerid = 200651
TargetWD repeat-containing protein 5 [24-334](Homo sapiens (Human))
The Regents Of The University Of Michigan
US Patent
LigandPNGBDBM200651(US9233086, 2A)
Affinity DataIC50: >1.00E+3nMpH: 6.5 T: 2°C. Assay description: N-terminal His-tagged WDR5Δ23 (residues 24-334) was expressed from the pET28-MHL vector in Rosetta2(DE3) pLysS cells (Novagen). Cells were grown...
Ligand InfoKEGGPC cidPC sid
In DepthDetails US Patent