BDBM20071 5-Substituted-6-chlorouracil, 13a::6-chloro-5-[(1E)-prop-1-en-1-yl]-1,2,3,4-tetrahydropyrimidine-2,4-dione
SMILES CC=Cc1c(Cl)[nH]c(=O)[nH]c1=O
InChI Key InChIKey=LGYIOPWXYKUGPC-UHFFFAOYSA-N
Data  1 KI
  Tab Delimited (TSV)   2D SDfile   Computed 3D by Vconf -m prep SDfile
Find this compound or compounds like it in BindingDB:
Activity Spreadsheet -- Enzyme Inhibition Constant Data from BindingDB
Found 1 hit for monomerid = 20071
TargetThymidine phosphorylase(Homo sapiens (Human))
Gilead Sciences
LigandPNGBDBM20071(5-Substituted-6-chlorouracil, 13a | 6-chloro-5-[(1...)
Affinity DataKi:  1.17E+3nM ΔG°:  -8.41kcal/molepH: 6.4 T: 2°C. Assay description: The enzyme reaction was started by the addition of enzyme to the reaction mixture containing substrate and test compounds. The reaction was stopped b...
In DepthDetails ArticlePubMed