BDBM200758 US9670231, 1.60
SMILES FC(F)(F)c1cccc(CC(=O)N[C@@H]2[C@H]3Oc4ccc(Oc5ccnc6NC(=O)CCc56)cc4[C@@H]23)c1
InChI Key InChIKey=CQLBJFSFGLKNEO-HJOGWXRNSA-N
Data  4 IC50
  Tab Delimited (TSV)   2D SDfile   Computed 3D by Vconf -m prep SDfile
Find this compound or compounds like it in BindingDB:
Activity Spreadsheet -- Enzyme Inhibition Constant Data from BindingDB
Found 4 hits for monomerid = 200758
TargetSerine/threonine-protein kinase B-raf [V600E](Homo sapiens (Human))
Beigene
US Patent
LigandPNGBDBM200758(US9670231, 1.60)
Affinity DataIC50:  1.5nM. Assay description: TBD
Ligand InfoPC cidPC sid
In DepthDetails US Patent
TargetEpidermal growth factor receptor [T790M,L858R](Homo sapiens (Human))
Beigene
US Patent
LigandPNGBDBM200758(US9670231, 1.60)
Affinity DataIC50:  2.55E+3nM. Assay description: TBD
Ligand InfoPC cidPC sid
In DepthDetails US Patent
TargetEpidermal growth factor receptor [L858R](Homo sapiens (Human))
Beigene
US Patent
LigandPNGBDBM200758(US9670231, 1.60)
Affinity DataIC50:  949nM. Assay description: TBD
Ligand InfoPC cidPC sid
In DepthDetails US Patent
TargetEpidermal growth factor receptor(Homo sapiens (Human))
Beigene
US Patent
LigandPNGBDBM200758(US9670231, 1.60)
Affinity DataIC50:  3.45E+3nM. Assay description: TBD
Ligand InfoPC cidPC sid
In DepthDetails US Patent