BDBM200787 US9670231, 1.70
SMILES CCCCCCCCCC(=O)N[C@@H]1[C@H]2Oc3ccc(Oc4ccnc5NC(=O)CCc45)cc3[C@@H]12
InChI Key InChIKey=SULSSSWEHDPZBW-GSDHBNRESA-N
Data  4 IC50
  Tab Delimited (TSV)   2D SDfile   Computed 3D by Vconf -m prep SDfile
Find this compound or compounds like it in BindingDB:
Activity Spreadsheet -- Enzyme Inhibition Constant Data from BindingDB
Found 4 hits for monomerid = 200787
TargetSerine/threonine-protein kinase B-raf [V600E](Homo sapiens (Human))
Beigene
US Patent
LigandPNGBDBM200787(US9670231, 1.70)
Affinity DataIC50:  24nM. Assay description: TBD
Ligand InfoPC cidPC sid
In DepthDetails US Patent
TargetEpidermal growth factor receptor [T790M,L858R](Homo sapiens (Human))
Beigene
US Patent
LigandPNGBDBM200787(US9670231, 1.70)
Affinity DataIC50:  1.30E+3nM. Assay description: TBD
Ligand InfoPC cidPC sid
In DepthDetails US Patent
TargetEpidermal growth factor receptor [L858R](Homo sapiens (Human))
Beigene
US Patent
LigandPNGBDBM200787(US9670231, 1.70)
Affinity DataIC50:  230nM. Assay description: TBD
Ligand InfoPC cidPC sid
In DepthDetails US Patent
TargetEpidermal growth factor receptor(Homo sapiens (Human))
Beigene
US Patent
LigandPNGBDBM200787(US9670231, 1.70)
Affinity DataIC50:  628nM. Assay description: TBD
Ligand InfoPC cidPC sid
In DepthDetails US Patent