BDBM200836 2-[2-methyl-6-((2s,3's)-2-methyl-[1,3']bipyrrolidinyl-1'-yl)-pyridin-3-yl]-1-oxo-2,8-diaza-spiro[4.5]decane-8-carboxylic acid tert-butyl ester::US9533995, 15
SMILES C[C@H]1CCCN1[C@H]1CCN(C1)c1ccc(N2CCC3(CCN(CC3)C(=O)OC(C)(C)C)C2=O)c(C)n1
InChI Key InChIKey=VWEDTHKZJLWCBY-UNMCSNQZSA-N
Data  1 KI
  Tab Delimited (TSV)   2D SDfile   Computed 3D by Vconf -m prep SDfile
Find this compound or compounds like it in BindingDB:
Activity Spreadsheet -- Enzyme Inhibition Constant Data from BindingDB
Found 1 hit for monomerid = 200836
TargetHistamine receptor H3(Macaca mulatta (Rhesus macaque))
Sanofi
US Patent
LigandPNGBDBM200836(2-[2-methyl-6-((2s,3's)-2-methyl-[1,3']bip...)
Affinity DataKi:  95.5nM. Assay description: Rhesus H3 radioligand binding assay was performed using rhesus H3 receptor membranes (prepared as described above), [3H]-Methylhistamine (Perkin Elme...
Ligand InfoPC cidPC sid
In DepthDetails US Patent