BDBM200924 US9233946, 23
SMILES Fc1cc(F)cc(c1)-c1ccc(s1)S(=O)(=O)Nc1cccc(c1)-c1nnn[nH]1
InChI Key InChIKey=OIXCRCNRRKERBR-UHFFFAOYSA-N
Data  1 IC50
  Tab Delimited (TSV)   2D SDfile   Computed 3D by Vconf -m prep SDfile
Find this compound or compounds like it in BindingDB:
Activity Spreadsheet -- Enzyme Inhibition Constant Data from BindingDB
Found 1 hit for monomerid = 200924
Target6-phosphofructo-2-kinase/fructose-2,6-bisphosphatase 3(Homo sapiens (Human))
Kancera
US Patent
LigandPNGBDBM200924(US9233946, 23)
Affinity DataIC50:  620nM. Assay description: Method B: The kinase activity of the bi-functional enzyme is readily quantified based on the production of ADP and F-2,6-P2 from ATP and F6P. The ADP...
Ligand InfoPC cidPC sid
In DepthDetails US Patent