BDBM20101 dipeptide-derived nitrile, 22::tert-butyl N-[(1S)-2-(benzyloxy)-1-[(cyanomethyl)carbamoyl]ethyl]carbamate
SMILES CC(C)(C)OC(=O)N[C@@H](COCc1ccccc1)C(=O)NCC#N
InChI Key InChIKey=OWYLKQJCVBXMAC-AWEZNQCLSA-N
Data  5 KI
  Tab Delimited (TSV)   2D SDfile   Computed 3D by Vconf -m prep SDfile
Find this compound or compounds like it in BindingDB:
Activity Spreadsheet -- Enzyme Inhibition Constant Data from BindingDB
Found 5 hits for monomerid = 20101
TargetCathepsin B(Homo sapiens (Human))
University Of Bonn
Curated by ChEMBL
LigandPNGBDBM20101(dipeptide-derived nitrile, 22 | tert-butyl N-[(1S)...)
Affinity DataKi: >330nMpH: 6.0Assay Description:Inhibition of human liver cathepsin B using Cbz-Arg-Arg-pNA as substrate at pH 6 incubated for 30 mins measured for 20 mins by photometrical analysis
Ligand InfoPC cidPC sid
In DepthDetails ArticlePubMed
TargetCathepsin S(Homo sapiens (Human))
Rheinische Friedrich-Wilhelms-Universitat Bonn
LigandPNGBDBM20101(dipeptide-derived nitrile, 22 | tert-butyl N-[(1S)...)
Affinity DataKi:  2.20E+3nM. Assay description: Enzyme activities were calculated from kinetic measurements performed by fluorimetric detection of the product AMC at the wavelengths for excitation ...
Ligand InfoPC cidPC sid
In DepthDetails ArticlePubMed
TargetPapain(Carica papaya)
Rheinische Friedrich-Wilhelms-Universitat Bonn
LigandPNGBDBM20101(dipeptide-derived nitrile, 22 | tert-butyl N-[(1S)...)
Affinity DataKi:  1.10E+4nM ΔG°:  -6.76kcal/molepH: 6.5 T: 2°C. Assay description: Enzyme activities were calculated from kinetic measurements performed by spectrophotometric detection of the product p-nitroaniline (pNA) at waveleng...
Ligand InfoPC cidPC sid
In DepthDetails ArticlePubMed
TargetProcathepsin L(Bos taurus (bovine))
Rheinische Friedrich-Wilhelms-Universitat Bonn
LigandPNGBDBM20101(dipeptide-derived nitrile, 22 | tert-butyl N-[(1S)...)
Affinity DataKi:  3.30E+4nM. Assay description: Enzyme activities were calculated from kinetic measurements performed by fluorimetric detection of the product AMC at the wavelengths for excitation ...
Ligand InfoPC cidPC sid
In DepthDetails ArticlePubMed
TargetCathepsin K(Homo sapiens (Human))
Rheinische Friedrich-Wilhelms-Universitat Bonn
LigandPNGBDBM20101(dipeptide-derived nitrile, 22 | tert-butyl N-[(1S)...)
Affinity DataKi: >1.00E+5nM. Assay description: Enzyme activities were calculated from kinetic measurements performed by fluorimetric detection of the product AMC at the wavelengths for excitation ...
Ligand InfoPC cidPC sid
In DepthDetails ArticlePubMed