BDBM201534 US9187424, 301
SMILES FC(F)Oc1ccc(cc1)C1=C(c2nn[nH]n2)C(=O)NC(C1)(c1ccc(OCCCCCC(F)(F)F)c(F)c1)C(F)(F)F
InChI Key
Data  1 IC50
  Tab Delimited (TSV)   2D SDfile   Computed 3D by Vconf -m prep SDfile
Find this compound or compounds like it in BindingDB:
Activity Spreadsheet -- Enzyme Inhibition Constant Data from BindingDB
Found 1 hit for monomerid = 201534
TargetAlpha-1,6-mannosyl-glycoprotein 2-beta-N-acetylglucosaminyltransferase(Homo sapiens (Human))
Bristol-Myers Squibb
US Patent
LigandPNGBDBM201534(US9187424, 301)
Affinity DataIC50:  19nMpH: 7.4Assay Description:The MGAT enzyme reactions were performed in CORNING Falcon 96-well Polypropylene plates, in a total volume of 60 uL of 50 mM Potassium Phosphate buff...
Ligand InfoPC cidPC sid
In DepthDetails US Patent