BDBM202087 US9233983, B-6
SMILES CC1(O)CCN(Cc2ccc(cc2)-c2cc3c(ncnc3[nH]2)-c2cccc(N3CCOc4cc(ccc4C3=O)C3CC3)c2CO)CC1
InChI Key InChIKey=OMINANNSBHUJEO-UHFFFAOYSA-N
Data  3 IC50
  Tab Delimited (TSV)   2D SDfile   Computed 3D by Vconf -m prep SDfile
Find this compound or compounds like it in BindingDB:
Activity Spreadsheet -- Enzyme Inhibition Constant Data from BindingDB
Found 3 hits for monomerid = 202087
TargetTyrosine-protein kinase BTK(Homo sapiens (Human))
Advinus Therapeutics
US Patent
LigandPNGBDBM202087(US9233983, B-6)
Affinity DataIC50:  7nM. Assay description: The inhibition assays were performed using the generic tyrosine kinase assay kit from C is Bio (HTRF KinEASE-TK #62TK0PEB). The assay is based on t...
Ligand InfoPC cidPC sid
In DepthDetails US Patent
TargetTyrosine-protein kinase BTK(Mus musculus)
Advinus Therapeutics
Curated by ChEMBL
LigandPNGBDBM202087(US9233983, B-6)
Affinity DataIC50:  81nM. Assay description: Inhibition of C57BL/6J mouse BTK assessed as decrease in anti-mouse IgM antibody stimulated BCR mediated CD69 upregulation preincubated for 30 mins f...
Ligand InfoPC cidPC sid
In DepthDetails ArticlePubMed
TargetTyrosine-protein kinase BTK(Homo sapiens (Human))
Advinus Therapeutics
US Patent
LigandPNGBDBM202087(US9233983, B-6)
Affinity DataIC50:  6.80nM. Assay description: Inhibition of recombinant human full length BTK preincubated for 10 mins followed by Tk-biotin peptide substrate addition after 90 mins by TR-FRET as...
Ligand InfoPC cidPC sid
In DepthDetails ArticlePubMed