BDBM20223 30, Ac-pTyr-Leu-Pro-Met(O2)-Thr-NH2::4-[(2S)-2-{[(2S)-1-[(2S)-2-{[(1S)-1-{[(1S,2S)-1-carbamoyl-2-hydroxypropyl]carbamoyl}-3-methanesulfonylpropyl]carbamoyl}pyrrolidin-1-yl]-4-methyl-1-oxopentan-2-yl]carbamoyl}-2-acetamidoethyl]phenoxyphosphonic acid
SMILES CC(C)C[C@H](NC(=O)[C@H](Cc1ccc(OP(O)(O)=O)cc1)NC(C)=O)C(=O)N1CCC[C@H]1C(=O)N[C@@H](CCS(C)(=O)=O)C(=O)N[C@@H](C(C)O)C(N)=O
InChI Key InChIKey=BMDZZGVRIDHRNS-RKJLTEIKSA-N
Data  1 IC50
  Tab Delimited (TSV)   2D SDfile   Computed 3D by Vconf -m prep SDfile
Find this compound or compounds like it in BindingDB:
Activity Spreadsheet -- Enzyme Inhibition Constant Data from BindingDB
Found 1 hit for monomerid = 20223
TargetSignal transducer and activator of transcription 3(Mus musculus (mouse))
The University Of Texas At Houston
LigandPNGBDBM20223(30, Ac-pTyr-Leu-Pro-Met(O2)-Thr-NH2 | 4-[(2S)-2-{[...)
Affinity DataIC50:  1.39E+4nMpH: 7.5 T: 2°C. Assay description: Fluorescence polarization (FP) binding assay is utilizing the intrinsic property of the fluorescent probe, which will have low polarization value whe...
In DepthDetails ArticlePubMed