BDBM20300 2-[(3,4-dimethylphenyl)methyl]-3-[2-(3-fluoro-4-methanesulfonamidophenyl)-2-methylpropanamido]propyl 2,2-dimethylpropanoate::dimethyl amide analogue, 21
SMILES Cc1ccc(CC(CNC(=O)C(C)(C)c2ccc(NS(C)(=O)=O)c(F)c2)COC(=O)C(C)(C)C)cc1C
InChI Key InChIKey=FOJDWLDFVVPKDW-UHFFFAOYSA-N
Data  1 KI  1 EC50
  Tab Delimited (TSV)   2D SDfile   Computed 3D by Vconf -m prep SDfile
Find this compound or compounds like it in BindingDB:
Activity Spreadsheet -- Enzyme Inhibition Constant Data from BindingDB
Found 1 hit for monomerid = 20300
TargetTransient receptor potential cation channel subfamily V member 1(Rattus norvegicus (rat))
Seoul National University
LigandPNGBDBM20300(2-[(3,4-dimethylphenyl)methyl]-3-[2-(3-fluoro-4-me...)
Affinity DataKi:  280nM ΔG°:  -9.29kcal/mole EC50:  65nMpH: 7.4 T: 2°C. Assay description: Binding assay mixtures were set up and contained [3H] RTX, various concentrations of competing ligands, and rVR1-transfected CHO cells. Nonspecific b...
In DepthDetails ArticlePubMed