BDBM20320 1-[(4-tert-butylphenyl)methyl]-3-[1-(4-methanesulfonamidophenyl)cyclopropyl]thiourea::thiourea analogue, 57
SMILES CC(C)(C)c1ccc(CNC(=S)NC2(CC2)c2ccc(NS(C)(=O)=O)cc2)cc1
InChI Key InChIKey=YYLVMGHNCVDXMB-UHFFFAOYSA-N
Data  1 KI  1 EC50
  Tab Delimited (TSV)   2D SDfile   Computed 3D by Vconf -m prep SDfile
Find this compound or compounds like it in BindingDB:
Activity Spreadsheet -- Enzyme Inhibition Constant Data from BindingDB
Found 1 hit for monomerid = 20320
TargetTransient receptor potential cation channel subfamily V member 1(Rattus norvegicus (rat))
Seoul National University
LigandPNGBDBM20320(1-[(4-tert-butylphenyl)methyl]-3-[1-(4-methanesulf...)
Affinity DataKi:  171nM ΔG°:  -9.60kcal/mole EC50:  60nMpH: 7.4 T: 2°C. Assay description: Binding assay mixtures were set up and contained [3H] RTX, various concentrations of competing ligands, and rVR1-transfected CHO cells. Nonspecific b...
In DepthDetails ArticlePubMed