BDBM20325 3-[(4-tert-butylphenyl)methyl]-1-[1-(3-fluoro-4-methanesulfonamidophenyl)propyl]thiourea::thiourea analogue, 31
SMILES CCC(NC(=S)NCc1ccc(cc1)C(C)(C)C)c1ccc(NS(C)(=O)=O)c(F)c1
InChI Key InChIKey=OLRNQJGCPCSVOA-UHFFFAOYSA-N
Data  1 KI  1 EC50
  Tab Delimited (TSV)   2D SDfile   Computed 3D by Vconf -m prep SDfile
Find this compound or compounds like it in BindingDB:
Activity Spreadsheet -- Enzyme Inhibition Constant Data from BindingDB
Found 1 hit for monomerid = 20325
TargetTransient receptor potential cation channel subfamily V member 1(Rattus norvegicus (rat))
Seoul National University
LigandPNGBDBM20325(3-[(4-tert-butylphenyl)methyl]-1-[1-(3-fluoro-4-me...)
Affinity DataKi:  230nM ΔG°:  -9.41kcal/mole EC50:  54nMpH: 7.4 T: 2°C. Assay description: Binding assay mixtures were set up and contained [3H] RTX, various concentrations of competing ligands, and rVR1-transfected CHO cells. Nonspecific b...
In DepthDetails ArticlePubMed