BDBM20329 3-[(4-tert-butylphenyl)methyl]-1-[2-(3-fluoro-4-methanesulfonamidophenyl)propan-2-yl]thiourea::thiourea analogue, 58
SMILES CC(C)(C)c1ccc(CNC(=S)NC(C)(C)c2ccc(NS(C)(=O)=O)c(F)c2)cc1
InChI Key InChIKey=OEGSVMKQKOMMCK-UHFFFAOYSA-N
Data  1 KI  1 EC50
  Tab Delimited (TSV)   2D SDfile   Computed 3D by Vconf -m prep SDfile
Find this compound or compounds like it in BindingDB:
Activity Spreadsheet -- Enzyme Inhibition Constant Data from BindingDB
Found 1 hit for monomerid = 20329
TargetTransient receptor potential cation channel subfamily V member 1(Rattus norvegicus (rat))
Seoul National University
LigandPNGBDBM20329(3-[(4-tert-butylphenyl)methyl]-1-[2-(3-fluoro-4-me...)
Affinity DataKi:  7.70E+3nM ΔG°:  -7.25kcal/mole EC50:  980nMpH: 7.4 T: 2°C. Assay description: Binding assay mixtures were set up and contained [3H] RTX, various concentrations of competing ligands, and rVR1-transfected CHO cells. Nonspecific b...
In DepthDetails ArticlePubMed